opensubscriber
   Find in this group all groups
 
Unknown more information…

a : avifile@prak.org 4 June 2005 • 2:56PM -0400

[Avifile]compile error
by Biglui

REPLY TO AUTHOR
 
REPLY TO GROUP



Hi, i alway had this fault by compiling Avifile

mmx.cpp: In function `void zoom_16_bpp(uint16_t*, const uint16_t*, int,
int, int, int, int)':
mmx.cpp:112: error: can't find a register in class `GENERAL_REGS' while
reloading `asm'
make[2]: *** [mmx.lo] Error 1
make[2]: Leaving directory
`/var/tmp/portage/avifile-0.7.43.20050224-r1/work/avifile-0.7-0.7.43/lib/common'
make[1]: *** [all-recursive] Error 1
make[1]: Leaving directory
`/var/tmp/portage/avifile-0.7.43.20050224-r1/work/avifile-0.7-0.7.43/lib'
make: *** [all-recursive] Error 1

can anyone help to fix ist?


_______________________________________________
Avifile mailing list
avifile@prak...
http://prak.org/mailman/listinfo/avifile

Bookmark with:

Delicious   Digg   reddit   Facebook   StumbleUpon

opensubscriber is not affiliated with the authors of this message nor responsible for its content.